Reaction Details
TargetcGMP-inhibited 3',5'-cyclic phosphodiesterase 3A/3B
LigandBDBM50100684
Substrate/Competitorn/a
Meas. Tech.ChEMBL_154421 (CHEMBL758020)
IC50>10000±n/a nM
Citation Ukita, TNakamura, YKubo, AYamamoto, YMoritani, YSaruta, KHigashijima, TKotera, JTakagi, MKikkawa, KOmori, K Novel, potent, and selective phosphodiesterase 5 inhibitors: synthesis and biological activities of a series of 4-aryl-1-isoquinolinone derivatives. J Med Chem44:2204-18 (2001) cGMP-inhibited 3',5'-cyclic phosphodiesterase 3A/3B
Name:cGMP-inhibited 3',5'-cyclic phosphodiesterase 3A/3B
Type:n/a
Mol. Mass.:n/a
Description:ASSAY_ID of ChEMBL is 156458
Components:This complex has 2 components.
Component 1
Name:cGMP-inhibited 3',5'-cyclic phosphodiesterase 3B
Synonyms:CGI-PDE B CGIPDE1 PDE3B Phosphodiesterase 3B Phosphodiesterase Type 3 (PDE3B) cGMP-inhibited 3,5-cyclic phosphodiesterase B
Type:Enzyme
Mol. Mass.:124318.95
Organism:Homo sapiens (Human)
Description:PDE3B was generated from the full-length recombinant human clone transfected into Sf9 cells.
Residue:1112
Component 2
Name:cGMP-inhibited 3',5'-cyclic phosphodiesterase 3A
Synonyms:3',5'-cyclic phosphodiesterase Cyclic GMP-inhibited phosphodiesterase A PDE3A_HUMAN Phosphodiesterase 3 (PDE3) Phosphodiesterase 3A Phosphodiesterase 3A (PDE3A1) cGMP-inhibited 3',5'-cyclic phosphodiesterase A | cGMP-inhibited 3,5-cyclic phosphodiesterase A
Type:Enzyme
Mol. Mass.:124966.46
Organism:Homo sapiens (Human)
Description:Q14432
Residue:1141
BDBM50100684
NameBDBM50100684
Synonyms:6,7-Dimethoxy-2-(4-methylamino-phenyl)-1-oxo-4-(3,4,5-trimethoxy-phenyl)-1,2-dihydro-isoquinoline-3-carboxylic acid methyl ester | CHEMBL305014
TypeSmall organic molecule
Emp. Form.C29H30N2O8
Mol. Mass.534.5571
SMILESCNc1ccc(cc1)-n1c(C(=O)OC)c(-c2cc(OC)c(OC)c(OC)c2)c2cc(OC)c(OC)cc2c1=O