Reaction Details
TargetDual specificity calcium/calmodulin-dependent 3',5'-cyclic nucleotide phosphodiesterase 1B/Dual specificity calcium/calmodulin-dependent 3',5'-cyclic nucleotide phosphodiesterase 1C/Phosphodiesterase
LigandBDBM50100684
Substrate/Competitorn/a
Meas. Tech.ChEMBL_154419 (CHEMBL758018)
IC50>10000±n/a nM
Citation Ukita, TNakamura, YKubo, AYamamoto, YMoritani, YSaruta, KHigashijima, TKotera, JTakagi, MKikkawa, KOmori, K Novel, potent, and selective phosphodiesterase 5 inhibitors: synthesis and biological activities of a series of 4-aryl-1-isoquinolinone derivatives. J Med Chem44:2204-18 (2001) Dual specificity calcium/calmodulin-dependent 3',5'-cyclic nucleotide phosphodiesterase 1B/Dual specificity calcium/calmodulin-dependent 3',5'-cyclic nucleotide phosphodiesterase 1C/Phosphodiesterase
Name:Dual specificity calcium/calmodulin-dependent 3',5'-cyclic nucleotide phosphodiesterase 1B/Dual specificity calcium/calmodulin-dependent 3',5'-cyclic nucleotide phosphodiesterase 1C/Phosphodiesterase
Type:n/a
Mol. Mass.:n/a
Description:ASSAY_ID of ChEMBL is 154419
Components:This complex has 3 components.
Component 1
Name:Dual specificity calcium/calmodulin-dependent 3',5'-cyclic nucleotide phosphodiesterase 1C
Synonyms:Calcium/calmodulin-dependent 3',5'-cyclic nucleotide phosphodiesterase 1C Dual specificity Calcium/calmodulin-dependent 3',5'-cyclic nucleotide phosphodiesterase 1C Pde1c | Pde1c2
Type:PROTEIN
Mol. Mass.:86691.70
Organism:Rattus norvegicus
Description:ChEMBL_105015
Residue:768
Component 2
Name:Phosphodiesterase
Synonyms:Pde1a | Phosphodiesterase 1A
Type:PROTEIN
Mol. Mass.:61851.57
Organism:Rattus norvegicus
Description:ChEMBL_105015
Residue:542
Component 3
Name:Dual specificity calcium/calmodulin-dependent 3',5'-cyclic nucleotide phosphodiesterase 1B
Synonyms:63 kDa Cam-PDE PDE1B_RAT Pde1b1 | Phosphodiesterase 1
Type:PROTEIN
Mol. Mass.:61248.78
Organism:Rattus norvegicus
Description:ChEMBL_105015
Residue:535
BDBM50100684
NameBDBM50100684
Synonyms:6,7-Dimethoxy-2-(4-methylamino-phenyl)-1-oxo-4-(3,4,5-trimethoxy-phenyl)-1,2-dihydro-isoquinoline-3-carboxylic acid methyl ester | CHEMBL305014
TypeSmall organic molecule
Emp. Form.C29H30N2O8
Mol. Mass.534.5571
SMILESCNc1ccc(cc1)-n1c(C(=O)OC)c(-c2cc(OC)c(OC)c(OC)c2)c2cc(OC)c(OC)cc2c1=O