Reaction Details
TargetMu-type opioid receptor
LigandBDBM50102710
Substrate/Competitorn/a
Meas. Tech.ChEMBL_149628 (CHEMBL873926)
Ki 171±n/a nM
Citation Thomas, JBAtkinson, RNRothman, RBFix, SEMascarella, SWVinson, NAXu, HDersch, CMLu, YCantrell, BEZimmerman, DMCarroll, FI Identification of the first trans-(3R,4R)- dimethyl-4-(3-hydroxyphenyl)piperidine derivative to possess highly potent and selective opioid kappa receptor antagonist activity. J Med Chem44:2687-90 (2001) Mu-type opioid receptor
Name:Mu-type opioid receptor
Type:G Protein-Coupled Receptor (GPCR)
Mol. Mass.:44503.11
Organism:Rattus norvegicus (rat)
Description:Competition binding assays were carried out using membrane preparations from transfected HN9.10 cells that constitutively expressed the mu opioid receptor.
Residue:398
BDBM50102710
NameBDBM50102710
Synonyms:3-(4-Hydroxy-phenyl)-N-{(S)-1-[(3R,4R)-4-(3-hydroxy-phenyl)-3,4-dimethyl-piperidin-1-ylmethyl]-2-methyl-propyl}-propionamide CHEMBL10986
TypeSmall organic molecule
Emp. Form.C27H38N2O3
Mol. Mass.438.6022
SMILESCC(C)[C@@H](CN1CC[C@](C)([C@@H](C)C1)c1cccc(O)c1)NC(=O)CCc1ccc(O)cc1