Reaction Details
TargetProthrombin
LigandBDBM50096088
Substrate/Competitorn/a
Meas. Tech.ChEMBL_208358 (CHEMBL813668)
Ki 450±n/a nM
Citation Pinto, DJOrwat, MJWang, SFevig, JMQuan, MLAmparo, ECacciola, JRossi, KAAlexander, RSSmallwood, AMLuettgen, JMLiang, LAungst, BJWright, MRKnabb, RMWong, PCWexler, RRLam, PY Discovery of 1-[3-(aminomethyl)phenyl]-N-3-fluoro-2'-(methylsulfonyl)-[1,1'-biphenyl]-4-yl]-3-(trifluoromethyl)-1H-pyrazole-5-carboxamide (DPC423), a highly potent, selective, and orally bioavailable inhibitor of blood coagulation factor Xa. J Med Chem44:566-78 (2001) Prothrombin
Name:Prothrombin
Type:Protein
Mol. Mass.:70029.57
Organism:Homo sapiens (Human)
Description:P00734
Residue:622
BDBM50096088
NameBDBM50096088
Synonyms:2-(3-Carbamimidoyl-phenyl)-5-methyl-2H-pyrazole-3-carboxylic acid (2'-fluoro-biphenyl-4-yl)-amide | CHEMBL152276
TypeSmall organic molecule
Emp. Form.C24H20FN5O
Mol. Mass.413.4469
SMILESCc1cc(C(=O)Nc2ccc(cc2)-c2ccccc2F)n(n1)-c1cccc(c1)C(N)=N