Reaction Details
TargetSerine protease 1/Trypsin-2
LigandBDBM50096106
Substrate/Competitorn/a
Meas. Tech.ChEMBL_212563 (CHEMBL814921)
Ki>1600±n/a nM
Citation Pinto, DJOrwat, MJWang, SFevig, JMQuan, MLAmparo, ECacciola, JRossi, KAAlexander, RSSmallwood, AMLuettgen, JMLiang, LAungst, BJWright, MRKnabb, RMWong, PCWexler, RRLam, PY Discovery of 1-[3-(aminomethyl)phenyl]-N-3-fluoro-2'-(methylsulfonyl)-[1,1'-biphenyl]-4-yl]-3-(trifluoromethyl)-1H-pyrazole-5-carboxamide (DPC423), a highly potent, selective, and orally bioavailable inhibitor of blood coagulation factor Xa. J Med Chem44:566-78 (2001) Serine protease 1/Trypsin-2
Name:Serine protease 1/Trypsin-2
Synonyms:Trypsin II
Type:n/a
Mol. Mass.:n/a
Description:ASSAY_ID of EBI is 212335
Components:This complex has 2 components.
Component 1
Name:Serine protease 1
Type:Enzyme
Mol. Mass.:26557.80
Organism:Homo sapiens (Human)
Description:P07477
Residue:247
Component 2
Name:Trypsin-2
Synonyms:Anionic trypsinogen Serine protease 2 TRY2_HUMAN Thrombin & trypsin Trypsin II | Trypsin-2
Type:PROTEIN
Mol. Mass.:26479.43
Organism:Homo sapiens (Human)
Description:ChEMBL_41517
Residue:247
BDBM50096106
NameBDBM50096106
Synonyms:2-(3-Carbamimidoyl-phenyl)-5-methyl-2H-pyrazole-3-carboxylic acid methyl-(2'-sulfamoyl-biphenyl-4-yl)-amide; TFA | CHEMBL358834
TypeSmall organic molecule
Emp. Form.C25H24N6O3S
Mol. Mass.488.561
SMILESCN(C(=O)c1cc(C)nn1-c1cccc(c1)C(N)=N)c1ccc(cc1)-c1ccccc1S(N)(=O)=O