Reaction Details
TargetTyrosine-protein phosphatase non-receptor type 1
LigandBDBM50113297
Substrate/Competitorn/a
Meas. Tech.ChEMBL_162252 (CHEMBL770119)
IC50 8600±n/a nM
Citation Doman, TNMcGovern, SLWitherbee, BJKasten, TPKurumbail, RStallings, WCConnolly, DTShoichet, BK Molecular docking and high-throughput screening for novel inhibitors of protein tyrosine phosphatase-1B. J Med Chem45:2213-21 (2002) Tyrosine-protein phosphatase non-receptor type 1
Name:Tyrosine-protein phosphatase non-receptor type 1
Type:Protein phosphatase
Mol. Mass.:49963.76
Organism:Homo sapiens (Human)
Description:Human recombinant GST-fusion PTP1B (1-435).
Residue:435
BDBM50113297
NameBDBM50113297
Synonyms:3-(4,5-Bis-biphenyl-4-yl-1H-imidazol-2-yl)-phenol | CHEMBL443007
TypeSmall organic molecule
Emp. Form.C33H24N2O
Mol. Mass.464.5565
SMILESOc1cccc(c1)-c1nc(c([nH]1)-c1ccc(cc1)-c1ccccc1)-c1ccc(cc1)-c1ccccc1