Reaction Details
TargetGonadotropin-releasing hormone receptor
LigandBDBM50122652
Substrate/Competitorn/a
Meas. Tech.ChEMBL_100005 (CHEMBL710690)
IC50 0.3±n/a nM
Citation Sasaki, SCho, NNara, YHarada, MEndo, SSuzuki, NFuruya, SFujino, M Discovery of a thieno[2,3-d]pyrimidine-2,4-dione bearing a p-methoxyureidophenyl moiety at the 6-position: a highly potent and orally bioavailable non-peptide antagonist for the human luteinizing hormone-releasing hormone receptor. J Med Chem46:113-24 (2002) 
 
Gonadotropin-releasing hormone receptor
Name:Gonadotropin-releasing hormone receptor
Type:Enzyme
Mol. Mass.:37749.45
Organism:Homo sapiens (Human)
Description:P30968
Residue:328
BDBM50122652
NameBDBM50122652
Synonyms:1-(4-(1-(2,6-difluorobenzyl)-5-((benzyl(methyl)amino)methyl)-2,4-dioxo-3-phenyl-1,2,3,4-tetrahydrothieno[2,3-d]pyrimidin-6-yl)phenyl)-3-ethylurea 1-{4-[5-[(Benzyl-methyl-amino)-methyl]-1-(2,6-difluoro-benzyl)-2,4-dioxo-3-phenyl-1,2,3,4-tetrahydro-thieno[2,3-d]pyrimidin-6-yl]-phenyl}-3-ethyl-urea; HCL.1.5H2O | CHEMBL435167
TypeSmall organic molecule
Emp. Form.C37H33F2N5O3S
Mol. Mass.665.751
SMILESCCNC(=O)Nc1ccc(cc1)-c1sc2n(Cc3c(F)cccc3F)c(=O)n(-c3ccccc3)c(=O)c2c1CN(C)Cc1ccccc1