Reaction Details
TargetCollagenase 3
LigandBDBM50128597
Substrate/Competitorn/a
Meas. Tech.ChEMBL_106632 (CHEMBL717016)
IC50 1±n/a nM
Citation Aranapakam, VDavis, JMGrosu, GTBaker, JEllingboe, JZask, ALevin, JISandanayaka, VPDu, MSkotnicki, JSDiJoseph, JFSung, ASharr, MAKillar, LMWalter, TJin, GCowling, RTillett, JZhao, WMcDevitt, JXu, ZB Synthesis and structure-activity relationship of N-substituted 4-arylsulfonylpiperidine-4-hydroxamic acids as novel, orally active matrix metalloproteinase inhibitors for the treatment of osteoarthritis. J Med Chem46:2376-96 (2003) 
 
Collagenase 3
Name:Collagenase 3
Type:Enzyme
Mol. Mass.:53808.06
Organism:Homo sapiens (Human)
Description:P45452
Residue:471
BDBM50128597
NameBDBM50128597
Synonyms:(R)-N-hydroxy-2-(4-methoxyphenylsulfonyl)-2-methyl-3-(4-(2-(piperidin-1-yl)ethoxy)phenyl)propanamide N-Hydroxy-2-(4-methoxy-benzenesulfonyl)-2-methyl-3-[4-(2-piperidin-1-yl-ethoxy)-phenyl]-propionamide
TypeSmall organic molecule
Emp. Form.C24H32N2O6S
Mol. Mass.476.586
SMILESCOc1ccc(cc1)S(=O)(=O)C(C)(Cc1ccc(OCCN2CCCCC2)cc1)C(=O)NO