Reaction Details
TargetInterstitial collagenase
LigandBDBM50128660
Substrate/Competitorn/a
Meas. Tech.ChEMBL_106291 (CHEMBL714547)
IC50 1930±n/a nM
Citation Aranapakam, VDavis, JMGrosu, GTBaker, JEllingboe, JZask, ALevin, JISandanayaka, VPDu, MSkotnicki, JSDiJoseph, JFSung, ASharr, MAKillar, LMWalter, TJin, GCowling, RTillett, JZhao, WMcDevitt, JXu, ZB Synthesis and structure-activity relationship of N-substituted 4-arylsulfonylpiperidine-4-hydroxamic acids as novel, orally active matrix metalloproteinase inhibitors for the treatment of osteoarthritis. J Med Chem46:2376-96 (2003) 
 
Interstitial collagenase
Name:Interstitial collagenase
Type:Enzyme
Mol. Mass.:54010.26
Organism:Homo sapiens (Human)
Description: P03956
Residue:469
BDBM50128660
NameBDBM50128660
Synonyms:4-(4-Methoxy-benzenesulfonyl)-1-(3-phenyl-propyl)-piperidine-4-carboxylic acid hydroxyamide N-hydroxy-4-(4-methoxyphenylsulfonyl)-1-(3-phenylpropyl)piperidine-4-carboxamide
TypeSmall organic molecule
Emp. Form.C22H28N2O5S
Mol. Mass.432.533
SMILESCOc1ccc(cc1)S(=O)(=O)C1(CCN(CCCc2ccccc2)CC1)C(=O)NO