Reaction Details
TargetCollagenase 3
LigandBDBM50128654
Substrate/Competitorn/a
Meas. Tech.ChEMBL_106632 (CHEMBL717016)
IC50 1.000±n/a nM
Citation Aranapakam, VDavis, JMGrosu, GTBaker, JEllingboe, JZask, ALevin, JISandanayaka, VPDu, MSkotnicki, JSDiJoseph, JFSung, ASharr, MAKillar, LMWalter, TJin, GCowling, RTillett, JZhao, WMcDevitt, JXu, ZB Synthesis and structure-activity relationship of N-substituted 4-arylsulfonylpiperidine-4-hydroxamic acids as novel, orally active matrix metalloproteinase inhibitors for the treatment of osteoarthritis. J Med Chem46:2376-96 (2003) 
 
Collagenase 3
Name:Collagenase 3
Type:Enzyme
Mol. Mass.:53808.06
Organism:Homo sapiens (Human)
Description:P45452
Residue:471
BDBM50128654
NameBDBM50128654
Synonyms:1-Benzyl-4-(4-benzyloxy-benzenesulfonyl)-piperidine-4-carboxylic acid hydroxyamide 1-benzyl-4-(4-(benzyloxy)phenylsulfonyl)-N-hydroxypiperidine-4-carboxamide | CHEMBL78369
TypeSmall organic molecule
Emp. Form.C26H28N2O5S
Mol. Mass.480.576
SMILESONC(=O)C1(CCN(Cc2ccccc2)CC1)S(=O)(=O)c1ccc(OCc2ccccc2)cc1