Reaction Details
TargetInterstitial collagenase
LigandBDBM50128631
Substrate/Competitorn/a
Meas. Tech.ChEMBL_106291 (CHEMBL714547)
IC50 3790±n/a nM
Citation Aranapakam, VDavis, JMGrosu, GTBaker, JEllingboe, JZask, ALevin, JISandanayaka, VPDu, MSkotnicki, JSDiJoseph, JFSung, ASharr, MAKillar, LMWalter, TJin, GCowling, RTillett, JZhao, WMcDevitt, JXu, ZB Synthesis and structure-activity relationship of N-substituted 4-arylsulfonylpiperidine-4-hydroxamic acids as novel, orally active matrix metalloproteinase inhibitors for the treatment of osteoarthritis. J Med Chem46:2376-96 (2003) 
 
Interstitial collagenase
Name:Interstitial collagenase
Type:Enzyme
Mol. Mass.:54010.26
Organism:Homo sapiens (Human)
Description: P03956
Residue:469
BDBM50128631
NameBDBM50128631
Synonyms:4-(4-Butoxy-benzenesulfonyl)-1-(3-phenoxy-propyl)-piperidine-4-carboxylic acid hydroxyamide CHEMBL78611
TypeSmall organic molecule
Emp. Form.C25H34N2O6S
Mol. Mass.490.612
SMILESCCCCOc1ccc(cc1)S(=O)(=O)C1(CCN(CCCOc2ccccc2)CC1)C(=O)NO