Reaction Details
TargetInterstitial collagenase
LigandBDBM50128633
Substrate/Competitorn/a
Meas. Tech.ChEMBL_106291 (CHEMBL714547)
IC50 4730±n/a nM
Citation Aranapakam, VDavis, JMGrosu, GTBaker, JEllingboe, JZask, ALevin, JISandanayaka, VPDu, MSkotnicki, JSDiJoseph, JFSung, ASharr, MAKillar, LMWalter, TJin, GCowling, RTillett, JZhao, WMcDevitt, JXu, ZB Synthesis and structure-activity relationship of N-substituted 4-arylsulfonylpiperidine-4-hydroxamic acids as novel, orally active matrix metalloproteinase inhibitors for the treatment of osteoarthritis. J Med Chem46:2376-96 (2003) 
 
Interstitial collagenase
Name:Interstitial collagenase
Type:Enzyme
Mol. Mass.:54010.26
Organism:Homo sapiens (Human)
Description: P03956
Residue:469
BDBM50128633
NameBDBM50128633
Synonyms:1-(4-fluorobenzyl)-4-(4-butoxyphenylsulfonyl)-N-hydroxypiperidine-4-carboxamide CHEMBL80401
TypeSmall organic molecule
Emp. Form.C23H29FN2O5S
Mol. Mass.464.55
SMILESCCCCOc1ccc(cc1)S(=O)(=O)C1(CCN(Cc2ccc(F)cc2)CC1)C(=O)NO