Reaction Details
TargetCollagenase 3
LigandBDBM50128655
Substrate/Competitorn/a
Meas. Tech.ChEMBL_106632 (CHEMBL717016)
IC50 2±n/a nM
Citation Aranapakam, VDavis, JMGrosu, GTBaker, JEllingboe, JZask, ALevin, JISandanayaka, VPDu, MSkotnicki, JSDiJoseph, JFSung, ASharr, MAKillar, LMWalter, TJin, GCowling, RTillett, JZhao, WMcDevitt, JXu, ZB Synthesis and structure-activity relationship of N-substituted 4-arylsulfonylpiperidine-4-hydroxamic acids as novel, orally active matrix metalloproteinase inhibitors for the treatment of osteoarthritis. J Med Chem46:2376-96 (2003) 
 
Collagenase 3
Name:Collagenase 3
Type:Enzyme
Mol. Mass.:53808.06
Organism:Homo sapiens (Human)
Description:P45452
Residue:471
BDBM50128655
NameBDBM50128655
Synonyms:1-(4-Fluoro-benzyl)-4-(4-methoxy-benzenesulfonyl)-piperidine-4-carboxylic acid hydroxyamide CHEMBL309416
TypeSmall organic molecule
Emp. Form.C20H23FN2O5S
Mol. Mass.422.47
SMILESCOc1ccc(cc1)S(=O)(=O)C1(CCN(Cc2ccc(F)cc2)CC1)C(=O)NO