Reaction Details
TargetMatrix metalloproteinase-9
LigandBDBM50128658
Substrate/Competitorn/a
Meas. Tech.ChEMBL_105516 (CHEMBL715225)
IC50 3±n/a nM
Citation Aranapakam, VDavis, JMGrosu, GTBaker, JEllingboe, JZask, ALevin, JISandanayaka, VPDu, MSkotnicki, JSDiJoseph, JFSung, ASharr, MAKillar, LMWalter, TJin, GCowling, RTillett, JZhao, WMcDevitt, JXu, ZB Synthesis and structure-activity relationship of N-substituted 4-arylsulfonylpiperidine-4-hydroxamic acids as novel, orally active matrix metalloproteinase inhibitors for the treatment of osteoarthritis. J Med Chem46:2376-96 (2003) 
 
Matrix metalloproteinase-9
Name:Matrix metalloproteinase-9
Type:Enzyme
Mol. Mass.:78452.28
Organism:Homo sapiens (Human)
Description:P14780
Residue:707
BDBM50128658
NameBDBM50128658
Synonyms:1-Benzyl-4-(4-furan-2-yl-benzenesulfonyl)-piperidine-4-carboxylic acid hydroxyamide CHEMBL311436
TypeSmall organic molecule
Emp. Form.C23H24N2O5S
Mol. Mass.440.512
SMILESONC(=O)C1(CCN(Cc2ccccc2)CC1)S(=O)(=O)c1ccc(cc1)-c1ccco1