Reaction Details
TargetDisintegrin and metalloproteinase domain-containing protein 17
LigandBDBM50128648
Substrate/Competitorn/a
Meas. Tech.ChEMBL_212594 (CHEMBL812727)
IC50 301±n/a nM
Citation Aranapakam, VDavis, JMGrosu, GTBaker, JEllingboe, JZask, ALevin, JISandanayaka, VPDu, MSkotnicki, JSDiJoseph, JFSung, ASharr, MAKillar, LMWalter, TJin, GCowling, RTillett, JZhao, WMcDevitt, JXu, ZB Synthesis and structure-activity relationship of N-substituted 4-arylsulfonylpiperidine-4-hydroxamic acids as novel, orally active matrix metalloproteinase inhibitors for the treatment of osteoarthritis. J Med Chem46:2376-96 (2003) 
 
Disintegrin and metalloproteinase domain-containing protein 17
Name:Disintegrin and metalloproteinase domain-containing protein 17
Type:Enzyme
Mol. Mass.:93007.89
Organism:Homo sapiens (Human)
Description:
Residue:824
BDBM50128648
NameBDBM50128648
Synonyms:1-Benzyl-4-[4-(4-chloro-phenoxy)-benzenesulfonyl]-piperidine-4-carboxylic acid hydroxyamide CHEMBL79433
TypeSmall organic molecule
Emp. Form.C25H25ClN2O5S
Mol. Mass.500.994
SMILESONC(=O)C1(CCN(Cc2ccccc2)CC1)S(=O)(=O)c1ccc(Oc2ccc(Cl)cc2)cc1