Reaction Details
TargetCollagenase 3
LigandBDBM50128676
Substrate/Competitorn/a
Meas. Tech.ChEMBL_106632 (CHEMBL717016)
IC50 3±n/a nM
Citation Aranapakam, VDavis, JMGrosu, GTBaker, JEllingboe, JZask, ALevin, JISandanayaka, VPDu, MSkotnicki, JSDiJoseph, JFSung, ASharr, MAKillar, LMWalter, TJin, GCowling, RTillett, JZhao, WMcDevitt, JXu, ZB Synthesis and structure-activity relationship of N-substituted 4-arylsulfonylpiperidine-4-hydroxamic acids as novel, orally active matrix metalloproteinase inhibitors for the treatment of osteoarthritis. J Med Chem46:2376-96 (2003) 
 
Collagenase 3
Name:Collagenase 3
Type:Enzyme
Mol. Mass.:53808.06
Organism:Homo sapiens (Human)
Description:P45452
Residue:471
BDBM50128676
NameBDBM50128676
Synonyms:4-(4-Methoxy-benzenesulfonyl)-1-(2-phenoxy-ethyl)-piperidine-4-carboxylic acid hydroxyamide N-hydroxy-4-(4-methoxyphenylsulfonyl)-1-(2-phenoxyethyl)piperidine-4-carboxamide
TypeSmall organic molecule
Emp. Form.C21H26N2O6S
Mol. Mass.434.506
SMILESCOc1ccc(cc1)S(=O)(=O)C1(CCN(CCOc2ccccc2)CC1)C(=O)NO