Reaction Details
TargetDisintegrin and metalloproteinase domain-containing protein 17
LigandBDBM50128641
Substrate/Competitorn/a
Meas. Tech.ChEMBL_212594 (CHEMBL812727)
IC50 298±n/a nM
Citation Aranapakam, VDavis, JMGrosu, GTBaker, JEllingboe, JZask, ALevin, JISandanayaka, VPDu, MSkotnicki, JSDiJoseph, JFSung, ASharr, MAKillar, LMWalter, TJin, GCowling, RTillett, JZhao, WMcDevitt, JXu, ZB Synthesis and structure-activity relationship of N-substituted 4-arylsulfonylpiperidine-4-hydroxamic acids as novel, orally active matrix metalloproteinase inhibitors for the treatment of osteoarthritis. J Med Chem46:2376-96 (2003) 
 
Disintegrin and metalloproteinase domain-containing protein 17
Name:Disintegrin and metalloproteinase domain-containing protein 17
Type:Enzyme
Mol. Mass.:93007.89
Organism:Homo sapiens (Human)
Description:
Residue:824
BDBM50128641
NameBDBM50128641
Synonyms:1-(4-(pyridin-2-yl)benzyl)-N-hydroxy-4-(4-methoxyphenylsulfonyl)piperidine-4-carboxamide CHEMBL80798
TypeSmall organic molecule
Emp. Form.C25H27N3O5S
Mol. Mass.481.564
SMILESCOc1ccc(cc1)S(=O)(=O)C1(CCN(Cc2ccc(cc2)-c2ccccn2)CC1)C(=O)NO