Reaction Details
TargetDisintegrin and metalloproteinase domain-containing protein 17
LigandBDBM50128654
Substrate/Competitorn/a
Meas. Tech.ChEMBL_212594 (CHEMBL812727)
IC50 416±n/a nM
Citation Aranapakam, VDavis, JMGrosu, GTBaker, JEllingboe, JZask, ALevin, JISandanayaka, VPDu, MSkotnicki, JSDiJoseph, JFSung, ASharr, MAKillar, LMWalter, TJin, GCowling, RTillett, JZhao, WMcDevitt, JXu, ZB Synthesis and structure-activity relationship of N-substituted 4-arylsulfonylpiperidine-4-hydroxamic acids as novel, orally active matrix metalloproteinase inhibitors for the treatment of osteoarthritis. J Med Chem46:2376-96 (2003) 
 
Disintegrin and metalloproteinase domain-containing protein 17
Name:Disintegrin and metalloproteinase domain-containing protein 17
Type:Enzyme
Mol. Mass.:93007.89
Organism:Homo sapiens (Human)
Description:
Residue:824
BDBM50128654
NameBDBM50128654
Synonyms:1-Benzyl-4-(4-benzyloxy-benzenesulfonyl)-piperidine-4-carboxylic acid hydroxyamide 1-benzyl-4-(4-(benzyloxy)phenylsulfonyl)-N-hydroxypiperidine-4-carboxamide | CHEMBL78369
TypeSmall organic molecule
Emp. Form.C26H28N2O5S
Mol. Mass.480.576
SMILESONC(=O)C1(CCN(Cc2ccccc2)CC1)S(=O)(=O)c1ccc(OCc2ccccc2)cc1