Reaction Details
TargetMatrix metalloproteinase-9
LigandBDBM50128639
Substrate/Competitorn/a
Meas. Tech.ChEMBL_105516 (CHEMBL715225)
IC50 20±n/a nM
Citation Aranapakam, VDavis, JMGrosu, GTBaker, JEllingboe, JZask, ALevin, JISandanayaka, VPDu, MSkotnicki, JSDiJoseph, JFSung, ASharr, MAKillar, LMWalter, TJin, GCowling, RTillett, JZhao, WMcDevitt, JXu, ZB Synthesis and structure-activity relationship of N-substituted 4-arylsulfonylpiperidine-4-hydroxamic acids as novel, orally active matrix metalloproteinase inhibitors for the treatment of osteoarthritis. J Med Chem46:2376-96 (2003) 
 
Matrix metalloproteinase-9
Name:Matrix metalloproteinase-9
Type:Enzyme
Mol. Mass.:78452.28
Organism:Homo sapiens (Human)
Description:P14780
Residue:707
BDBM50128639
NameBDBM50128639
Synonyms:1-(3,4-dichlorobenzyl)-4-(4-butoxyphenylsulfonyl)-N-hydroxypiperidine-4-carboxamide CHEMBL78934
TypeSmall organic molecule
Emp. Form.C23H28Cl2N2O5S
Mol. Mass.515.45
SMILESCCCCOc1ccc(cc1)S(=O)(=O)C1(CCN(Cc2ccc(Cl)c(Cl)c2)CC1)C(=O)NO