Reaction Details
TargetMethionine aminopeptidase 1
LigandBDBM50129640
Substrate/Competitorn/a
Meas. Tech.ChEMBL_105134 (CHEMBL715018)
IC50 770±n/a nM
Citation Luo, QLLi, JYLiu, ZYChen, LLLi, JQian, ZShen, QLi, YLushington, GHYe, QZNan, FJ Discovery and structural modification of inhibitors of methionine aminopeptidases from Escherichia coli and Saccharomyces cerevisiae. J Med Chem46:2631-40 (2003) 
 
Methionine aminopeptidase 1
Name:Methionine aminopeptidase 1
Type:PROTEIN
Mol. Mass.:43382.92
Organism:Saccharomyces cerevisiae
Description:ChEMBL_10701
Residue:387
BDBM50129640
NameBDBM50129640
Synonyms:3-(3-Methyl-but-2-enoylamino)-pyridine-2-carboxylic acid thiazol-2-ylamide | CHEMBL313629
TypeSmall organic molecule
Emp. Form.C14H14N4O2S
Mol. Mass.302.352
SMILES[#6]\[#6](-[#6])=[#6]\[#6](=O)-[#7]-c1cccnc1-[#6](=O)-[#7]-c1nccs1