Reaction Details
TargetMethionine aminopeptidase 1
LigandBDBM50129646
Substrate/Competitorn/a
Meas. Tech.ChEMBL_105134 (CHEMBL715018)
IC50 490±n/a nM
Citation Luo, QLLi, JYLiu, ZYChen, LLLi, JQian, ZShen, QLi, YLushington, GHYe, QZNan, FJ Discovery and structural modification of inhibitors of methionine aminopeptidases from Escherichia coli and Saccharomyces cerevisiae. J Med Chem46:2631-40 (2003) 
 
Methionine aminopeptidase 1
Name:Methionine aminopeptidase 1
Type:PROTEIN
Mol. Mass.:43382.92
Organism:Saccharomyces cerevisiae
Description:ChEMBL_10701
Residue:387
BDBM50129646
NameBDBM50129646
Synonyms:3-Methyl-but-2-enoic acid 2-(thiazol-2-ylcarbamoyl)-pyridin-3-yl ester | CHEMBL88864
TypeSmall organic molecule
Emp. Form.C14H13N3O3S
Mol. Mass.303.336
SMILES[#6]\[#6](-[#6])=[#6]\[#6](=O)-[#8]-c1cccnc1-[#6](=O)-[#7]-c1nccs1