Reaction Details
TargetMethionine aminopeptidase 1
LigandBDBM50129672
Substrate/Competitorn/a
Meas. Tech.ChEMBL_105134 (CHEMBL715018)
IC50 350±n/a nM
Citation Luo, QLLi, JYLiu, ZYChen, LLLi, JQian, ZShen, QLi, YLushington, GHYe, QZNan, FJ Discovery and structural modification of inhibitors of methionine aminopeptidases from Escherichia coli and Saccharomyces cerevisiae. J Med Chem46:2631-40 (2003) 
 
Methionine aminopeptidase 1
Name:Methionine aminopeptidase 1
Type:PROTEIN
Mol. Mass.:43382.92
Organism:Saccharomyces cerevisiae
Description:ChEMBL_10701
Residue:387
BDBM50129672
NameBDBM50129672
Synonyms:3-Propionylamino-pyridine-2-carboxylic acid thiazol-2-ylamide | CHEMBL92374
TypeSmall organic molecule
Emp. Form.C12H12N4O2S
Mol. Mass.276.314
SMILESCCC(=O)Nc1cccnc1C(=O)Nc1nccs1