Reaction Details
TargetMethionine aminopeptidase 1
LigandBDBM50129675
Substrate/Competitorn/a
Meas. Tech.ChEMBL_105134 (CHEMBL715018)
IC50 550±n/a nM
Citation Luo, QLLi, JYLiu, ZYChen, LLLi, JQian, ZShen, QLi, YLushington, GHYe, QZNan, FJ Discovery and structural modification of inhibitors of methionine aminopeptidases from Escherichia coli and Saccharomyces cerevisiae. J Med Chem46:2631-40 (2003) 
 
Methionine aminopeptidase 1
Name:Methionine aminopeptidase 1
Type:PROTEIN
Mol. Mass.:43382.92
Organism:Saccharomyces cerevisiae
Description:ChEMBL_10701
Residue:387
BDBM50129675
NameBDBM50129675
Synonyms:2-Methoxy-benzoic acid 2-(thiazol-2-ylcarbamoyl)-pyridin-3-yl ester | CHEMBL88599
TypeSmall organic molecule
Emp. Form.C17H13N3O4S
Mol. Mass.355.368
SMILESCOc1ccccc1C(=O)Oc1cccnc1C(=O)Nc1nccs1