Reaction Details
TargetMethionine aminopeptidase 1
LigandBDBM50113436
Substrate/Competitorn/a
Meas. Tech.ChEMBL_105134 (CHEMBL715018)
IC50>100000±n/a nM
Citation Luo, QLLi, JYLiu, ZYChen, LLLi, JQian, ZShen, QLi, YLushington, GHYe, QZNan, FJ Discovery and structural modification of inhibitors of methionine aminopeptidases from Escherichia coli and Saccharomyces cerevisiae. J Med Chem46:2631-40 (2003) 
 
Methionine aminopeptidase 1
Name:Methionine aminopeptidase 1
Type:PROTEIN
Mol. Mass.:43382.92
Organism:Saccharomyces cerevisiae
Description:ChEMBL_10701
Residue:387
BDBM50113436
NameBDBM50113436
Synonyms:CHEMBL32838 | fumagillin
TypeSmall organic molecule
Emp. Form.C26H34O7
Mol. Mass.458.544
SMILES[#6]-[#8]-[#6@@H]-1-[#6@@H](-[#6]-[#6][C@]2([#6]-[#8]2)[#6@H]-1[C@@]1([#6])[#8]-[#6@@H]1-[#6]\[#6]=[#6](/[#6])-[#6])-[#8]-[#6](=O)\[#6]=[#6]\[#6]=[#6]\[#6]=[#6]\[#6]=[#6]\[#6](-[#8])=O