Reaction Details
TargetBeta-lactamase
LigandBDBM31770
Substrate/Competitorn/a
Meas. Tech.ChEMBL_40567 (CHEMBL651415)
IC50 14000±n/a nM
Citation Seidler, JMcGovern, SLDoman, TNShoichet, BK Identification and prediction of promiscuous aggregating inhibitors among known drugs. J Med Chem46:4477-86 (2003) 
 
Beta-lactamase
Name:Beta-lactamase
Type:Protien
Mol. Mass.:41561.62
Organism:Escherichia coli
Description:P00811
Residue:377
BDBM31770
NameBDBM31770
Synonyms:Exelderm cid_65495 | sulconazole
TypeSmall organic molecule
Emp. Form.C18H15Cl3N2S
Mol. Mass.397.749
SMILESClc1ccc(CSC(Cn2ccnc2)c2ccc(Cl)cc2Cl)cc1