Reaction Details
TargetBeta-lactamase
LigandBDBM50134035
Substrate/Competitorn/a
Meas. Tech.ChEMBL_40567 (CHEMBL651415)
IC50 90000±n/a nM
Citation Seidler, JMcGovern, SLDoman, TNShoichet, BK Identification and prediction of promiscuous aggregating inhibitors among known drugs. J Med Chem46:4477-86 (2003) 
 
Beta-lactamase
Name:Beta-lactamase
Type:Protien
Mol. Mass.:41561.62
Organism:Escherichia coli
Description:P00811
Residue:377
BDBM50134035
NameBDBM50134035
Synonyms:BENZYL BENZOATE | CHEMBL1239
TypeSmall organic molecule
Emp. Form.C14H12O2
Mol. Mass.212.2439
SMILESO=C(OCc1ccccc1)c1ccccc1