Reaction Details
TargetDipeptidyl peptidase 4
LigandBDBM50146004
Substrate/Competitorn/a
Meas. Tech.ChEMBL_53378 (CHEMBL665782)
Ki 29±n/a nM
Citation Magnin, DRRobl, JASulsky, RBAugeri, DJHuang, YSimpkins, LMTaunk, PCBetebenner, DARobertson, JGAbboa-Offei, BEWang, ACap, MXin, LTao, LSitkoff, DFMalley, MFGougoutas, JZKhanna, AHuang, QHan, SPParker, RAHamann, LG Synthesis of novel potent dipeptidyl peptidase IV inhibitors with enhanced chemical stability: interplay between the N-terminal amino acid alkyl side chain and the cyclopropyl group of alpha-aminoacyl-l-cis-4,5-methanoprolinenitrile-based inhibitors. J Med Chem47:2587-98 (2004) 
 
Dipeptidyl peptidase 4
Name:Dipeptidyl peptidase 4
Type:Enzyme
Mol. Mass.:88235.21
Organism:Sus scrofa (pig)
Description:n/a
Residue:766
BDBM50146004
NameBDBM50146004
Synonyms:(1R,5R)-2-((S)-2-Amino-3-methyl-butyryl)-2-aza-bicyclo[3.1.0]hexane-3-carbonitrile; TFA | CHEMBL88680
TypeSmall organic molecule
Emp. Form.C11H17N3O
Mol. Mass.207.2722
SMILESCC(C)[C@H](N)C(=O)N1[C@@H]2C[C@@H]2CC1C#N