Reaction Details
TargetDipeptidyl peptidase 4
LigandBDBM50151003
Substrate/Competitorn/a
Meas. Tech.ChEMBL_53378 (CHEMBL665782)
Ki 8±n/a nM
Citation Magnin, DRRobl, JASulsky, RBAugeri, DJHuang, YSimpkins, LMTaunk, PCBetebenner, DARobertson, JGAbboa-Offei, BEWang, ACap, MXin, LTao, LSitkoff, DFMalley, MFGougoutas, JZKhanna, AHuang, QHan, SPParker, RAHamann, LG Synthesis of novel potent dipeptidyl peptidase IV inhibitors with enhanced chemical stability: interplay between the N-terminal amino acid alkyl side chain and the cyclopropyl group of alpha-aminoacyl-l-cis-4,5-methanoprolinenitrile-based inhibitors. J Med Chem47:2587-98 (2004) 
 
Dipeptidyl peptidase 4
Name:Dipeptidyl peptidase 4
Type:Enzyme
Mol. Mass.:88235.21
Organism:Sus scrofa (pig)
Description:n/a
Residue:766
BDBM50151003
NameBDBM50151003
Synonyms:(S)-1-((S)-2-Amino-3,3-dimethyl-butyryl)-pyrrolidine-2-carbonitrile CHEMBL363250 US11559537, Compound 9987
TypeSmall organic molecule
Emp. Form.C11H19N3O
Mol. Mass.209.2881
SMILESCC(C)(C)[C@H](N)C(=O)N1CCC[C@H]1C#N