Reaction Details
TargetDipeptidyl peptidase 4
LigandBDBM50146011
Substrate/Competitorn/a
Meas. Tech.ChEMBL_53378 (CHEMBL665782)
Ki 7500±n/a nM
Citation Magnin, DRRobl, JASulsky, RBAugeri, DJHuang, YSimpkins, LMTaunk, PCBetebenner, DARobertson, JGAbboa-Offei, BEWang, ACap, MXin, LTao, LSitkoff, DFMalley, MFGougoutas, JZKhanna, AHuang, QHan, SPParker, RAHamann, LG Synthesis of novel potent dipeptidyl peptidase IV inhibitors with enhanced chemical stability: interplay between the N-terminal amino acid alkyl side chain and the cyclopropyl group of alpha-aminoacyl-l-cis-4,5-methanoprolinenitrile-based inhibitors. J Med Chem47:2587-98 (2004) 
 
Dipeptidyl peptidase 4
Name:Dipeptidyl peptidase 4
Type:Enzyme
Mol. Mass.:88235.21
Organism:Sus scrofa (pig)
Description:n/a
Residue:766
BDBM50146011
NameBDBM50146011
Synonyms:(1S,5R)-2-((S)-2-Amino-3-methyl-pentanoyl)-2-aza-bicyclo[3.1.0]hexane-1-carbonitrile; TFA | CHEMBL90223
TypeSmall organic molecule
Emp. Form.C12H19N3O
Mol. Mass.221.2988
SMILESCCC(C)[C@H](N)C(=O)N1CC[C@@H]2C[C@]12C#N