Reaction Details
TargetDelta-type opioid receptor
LigandBDBM50006946
Substrate/Competitorn/a
Meas. Tech.ChEMBL_145483 (CHEMBL751977)
Ki 19±n/a nM
Citation Carroll, FIZhang, LMascarella, SWNavarro, HARothman, RBCantrell, BEZimmerman, DMThomas, JB Discovery of the first N-substituted 4beta-methyl-5-(3-hydroxyphenyl)morphan to possess highly potent and selective opioid delta receptor antagonist activity. J Med Chem47:281-4 (2004) 
 
Delta-type opioid receptor
Name:Delta-type opioid receptor
Type:G Protein-Coupled Receptor (GPCR)
Mol. Mass.:40382.98
Organism:Homo sapiens (Human)
Description:Competition binding assays were carried out using membrane preparations from transfected HN9.10 cells that constitutively expressed the delta opioid receptor.
Residue:372
BDBM50006946
NameBDBM50006946
Synonyms:2-[2-(2-{2-[2-Diallylamino-3-(4-hydroxy-phenyl)-propionylamino]-2-methyl-propionylamino}-2-methyl-propionylamino)-3-phenyl-propionylamino]-4-methyl-pentanoic acid ICI-174864
TypeSmall organic molecule
Emp. Form.C38H53N5O7
Mol. Mass.691.8567
SMILESCC(C)C[C@H](NC(=O)[C@H](Cc1ccccc1)NC(=O)C(C)(C)NC(=O)C(C)(C)NC(=O)[C@H](Cc1ccc(O)cc1)N(CC=C)CC=C)C(O)=O