Reaction Details
TargetMotilin receptor
LigandBDBM50143028
Substrate/Competitorn/a
Meas. Tech.ChEMBL_122662 (CHEMBL732792)
Ki 0.7±n/a nM
Citation Li, JJChao, HGWang, HTino, JALawrence, RMEwing, WRMa, ZYan, MSlusarchyk, DSeethala, RSun, HLi, DBurford, NTStoffel, RHSalyan, MELi, CYWitkus, MZhao, NRich, AGordon, DA Discovery of a potent and novel motilin agonist. J Med Chem47:1704-8 (2004) 
 
Motilin receptor
Name:Motilin receptor
Type:PROTEIN
Mol. Mass.:45365.95
Organism:Homo sapiens (Human)
Description:ChEMBL_122664
Residue:412
BDBM50143028
NameBDBM50143028
Synonyms:8'N-[1-[1-carbamoyl-3-phenyl-(1S)-propylcarbamoyl]-3-phenyl-(1S)-propyl]-2'-benzo[d][1,3]dioxol-5-ylmethyl-1',3'-dioxospiro[hexahydropyridine-4,5'-perhydro[1,2,4]triazolo[1,2-a]pyridazine]-8'-carboxamide | CHEMBL297494
TypeSmall organic molecule
Emp. Form.C39H45N7O7
Mol. Mass.723.8173
SMILESNC(=O)[C@H](CCc1ccccc1)NC(=O)[C@H](CCc1ccccc1)NC(=O)C1CCC2(CCNCC2)n2n1c(=O)n(Cc1ccc3OCOc3c1)c2=O