Reaction Details
TargetSphingosine 1-phosphate receptor 3
LigandBDBM50152328
Substrate/Competitorn/a
Meas. Tech.ChEMBL_306055 (CHEMBL833011)
IC50 4.7±n/a nM
Citation Yan, LHale, JJLynch, CLBudhu, RGentry, AMills, SGHajdu, RKeohane, CARosenbach, MJMilligan, JAShei, GJChrebet, GBergstrom, JCard, DRosen, HMandala, SM Design and synthesis of conformationally constrained 3-(N-alkylamino)propylphosphonic acids as potent agonists of sphingosine-1-phosphate (S1P) receptors. Bioorg Med Chem Lett14:4861-6 (2004) 
 
Sphingosine 1-phosphate receptor 3
Name:Sphingosine 1-phosphate receptor 3
Type:G Protein-Coupled Receptor (GPCR)
Mol. Mass.:42278.13
Organism:Homo sapiens (Human)
Description:Q99500
Residue:378
BDBM50152328
NameBDBM50152328
Synonyms:CHEMBL181597 | [(1S,3S)-3-(4-Nonyl-benzylamino)-cyclohexyl]-phosphonic acid
TypeSmall organic molecule
Emp. Form.C22H38NO3P
Mol. Mass.395.5158
SMILESCCCCCCCCCc1ccc(CN[C@H]2CCC[C@@H](C2)P(O)(O)=O)cc1