Reaction Details
TargetSphingosine 1-phosphate receptor 1
LigandBDBM50152326
Substrate/Competitorn/a
Meas. Tech.ChEMBL_306053 (CHEMBL833009)
IC50 50±n/a nM
Citation Yan, LHale, JJLynch, CLBudhu, RGentry, AMills, SGHajdu, RKeohane, CARosenbach, MJMilligan, JAShei, GJChrebet, GBergstrom, JCard, DRosen, HMandala, SM Design and synthesis of conformationally constrained 3-(N-alkylamino)propylphosphonic acids as potent agonists of sphingosine-1-phosphate (S1P) receptors. Bioorg Med Chem Lett14:4861-6 (2004) 
 
Sphingosine 1-phosphate receptor 1
Name:Sphingosine 1-phosphate receptor 1
Type:Enzyme
Mol. Mass.:42836.02
Organism:Homo sapiens (Human)
Description:P21453
Residue:382
BDBM50152326
NameBDBM50152326
Synonyms:CHEMBL363008 | [Hydroxy-(1-tetradecyl-pyrrolidin-3-yl)-methyl]-phosphonic acid
TypeSmall organic molecule
Emp. Form.C19H40NO4P
Mol. Mass.377.499
1CCC(C1)C(=O)P(O)(O)O