Reaction Details
TargetSphingosine 1-phosphate receptor 4
LigandBDBM50152337
Substrate/Competitorn/a
Meas. Tech.ChEMBL_306056 (CHEMBL833012)
IC50 15±n/a nM
Citation Yan, LHale, JJLynch, CLBudhu, RGentry, AMills, SGHajdu, RKeohane, CARosenbach, MJMilligan, JAShei, GJChrebet, GBergstrom, JCard, DRosen, HMandala, SM Design and synthesis of conformationally constrained 3-(N-alkylamino)propylphosphonic acids as potent agonists of sphingosine-1-phosphate (S1P) receptors. Bioorg Med Chem Lett14:4861-6 (2004) 
 
Sphingosine 1-phosphate receptor 4
Name:Sphingosine 1-phosphate receptor 4
Type:G Protein-Coupled Receptor (GPCR)
Mol. Mass.:41647.39
Organism:Homo sapiens (Human)
Description:n/a
Residue:384
BDBM50152337
NameBDBM50152337
Synonyms:2-amino-2-({[dihydroxy(oxido)--phosphanyl]oxy}methyl)-4-(4-octylphenyl)butan-1-ol | 3-(N-alkylamino) propylphosphonic acid derivative
TypeSmall organic molecule
Emp. Form.C19H35NO5P
Mol. Mass.388.4592
SMILESCCCCCCCCc1ccc(CCC(N)(CO)COP(O)(O)[O-])cc1