Reaction Details
TargetBeta-1 adrenergic receptor
LigandBDBM50027166
Substrate/Competitorn/a
Meas. Tech.ChEMBL_310554 (CHEMBL834455)
EC50 4±n/a nM
Citation Nakajima, YHamashima, HWashizuka, KTomishima, YOhtake, HImamura, EMiura, TKayakiri, HKato, M Discovery of a novel, potent and selective human beta3-adrenergic receptor agonist. Bioorg Med Chem Lett15:251-4 (2004) 
 
Beta-1 adrenergic receptor
Name:Beta-1 adrenergic receptor
Type:G Protein-Coupled Receptor (GPCR)
Mol. Mass.:51338.40
Organism:Homo sapiens (Human)
Description:P08588
Residue:477
BDBM50027166
NameBDBM50027166
Synonyms:CHEMBL183611
TypeSmall organic molecule
Emp. Form.C26H31N3O5
Mol. Mass.465.5414
SMILESCOc1cccc(NC(=O)Nc2ccc(C[C@@H](CO)NC[C@H](O)COc3ccccc3)cc2)c1