Reaction Details
TargetProtein farnesyltransferase subunit beta/geranylgeranyltransferase type-1 subunit alpha
LigandBDBM50164003
Substrate/Competitorn/a
Meas. Tech.ChEMBL_312466 (CHEMBL833084)
IC50 8±n/a nM
Citation Lombardo, LJCamuso, AClark, JFager, KGullo-Brown, JHunt, JTInigo, IKan, DKoplowitz, BLee, FMcGlinchey, KQian, LRicca, CRovnyak, GTraeger, STokarski, JWilliams, DKWu, LIZhao, YManne, VBhide, RS Design, synthesis, and structure-activity relationships of tetrahydroquinoline-based farnesyltransferase inhibitors. Bioorg Med Chem Lett15:1895-9 (2005) 
 
Protein farnesyltransferase subunit beta/geranylgeranyltransferase type-1 subunit alpha
Name:Protein farnesyltransferase subunit beta/geranylgeranyltransferase type-1 subunit alpha
Type:n/a
Mol. Mass.:n/a
Description:ASSAY_ID of EBI is 69815
Components:This complex has 2 components.
Component 1
Name:Protein farnesyltransferase subunit beta
Synonyms:CAAX farnesyltransferase subunit beta FTase-beta Protein farnesyltransferase Ras proteins prenyltransferase subunit beta
Type:PROTEIN
Mol. Mass.:48666.41
Organism:Rattus norvegicus
Description:EBI_10573
Residue:437
Component 2
Name:Protein farnesyltransferase/geranylgeranyltransferase type-1 subunit alpha
Synonyms:CAAX farnesyltransferase alpha subunit FTase-alpha GGTase-I-alpha Protein farnesyltransferase/geranylgeranyltransferase type I alpha subunit Type I protein geranyl-geranyltransferase alpha subunit | geranylgeranyltransferase type-I
Type:Enzyme
Mol. Mass.:44030.14
Organism:Rattus norvegicus (rat)
Description:Recombinant rat enzyme.
Residue:377
BDBM50164003
NameBDBM50164003
Synonyms:CHEMBL183773 | N-[6-Cyano-1-(3-methyl-3H-imidazol-4-ylmethyl)-1,2,3,4-tetrahydro-quinolin-3-yl]-N-(2-methyl-allyl)-methanesulfonamide
TypeSmall organic molecule
Emp. Form.C20H25N5O2S
Mol. Mass.399.51
SMILESCC(=C)CN(C1CN(Cc2cncn2C)c2ccc(cc2C1)C#N)S(C)(=O)=O