Reaction Details
TargetProtein farnesyltransferase subunit beta/geranylgeranyltransferase type-1 subunit alpha
LigandBDBM13323
Substrate/Competitorn/a
Meas. Tech.ChEMBL_305032 (CHEMBL831671)
IC50 1.1±n/a nM
Citation Lombardo, LJCamuso, AClark, JFager, KGullo-Brown, JHunt, JTInigo, IKan, DKoplowitz, BLee, FMcGlinchey, KQian, LRicca, CRovnyak, GTraeger, STokarski, JWilliams, DKWu, LIZhao, YManne, VBhide, RS Design, synthesis, and structure-activity relationships of tetrahydroquinoline-based farnesyltransferase inhibitors. Bioorg Med Chem Lett15:1895-9 (2005) 
 
Protein farnesyltransferase subunit beta/geranylgeranyltransferase type-1 subunit alpha
Name:Protein farnesyltransferase subunit beta/geranylgeranyltransferase type-1 subunit alpha
Type:Protein Complex
Mol. Mass.:n/a
Description:To express recombinant enzyme in E. coli, the cloned human alpha and beta subunits were co-expressed from a plasmid, in which their expression was translationally coupled.
Components:This complex has 2 components.
Component 1
Name:Protein farnesyltransferase subunit beta
Synonyms:CAAX farnesyltransferase subunit alpha FNTB FTase-alpha GGTase-I-alpha Protein farnesyl/geranylgeranyl transferase Protein farnesyltransferase subunit beta Protein farnesyltransferase/geranylgeranyltransferase type-1 subunit alpha Ras proteins prenyltransferase subunit beta | Type I protein geranyl-geranyltransferase subunit alpha
Type:Enzyme Subunit
Mol. Mass.:48766.02
Organism:Homo sapiens (Human)
Description:Protein farnesyltransferase subunit beta
Residue:437
Component 2
Name:Protein farnesyltransferase/geranylgeranyltransferase type-1 subunit alpha
Synonyms:CAAX farnesyltransferase alpha subunit FNTA_HUMAN FTase-alpha Geranylgeranyl Transferase (GGTase-I) Chain A Protein Farnesyltransferase (PFT) Chain A Protein farnesyltransferase Protein farnesyltransferase/geranylgeranyltransferase type I alpha subunit | Ras proteins prenyltransferase alpha
Type:Enzyme
Mol. Mass.:44392.46
Organism:Homo sapiens (Human)
Description:Recombinant human FTase.
Residue:379
BDBM13323
NameBDBM13323
Synonyms:1-Methyl-1H-imidazole-4-sulfonic Acid Benzyl-[6-cyano1-(3-methyl-3H-imidazol-4-ylmethyl)-1,2,3,4-tetrahydroquinolin-3-yl]amide CHEMBL182888 tetrahydroquinoline (THQ)-based inhibitor 4e
TypeSmall organic molecule
Emp. Form.C26H27N7O2S
Mol. Mass.501.603
SMILESCn1cnc(c1)S(=O)(=O)N(Cc1ccccc1)C1CN(Cc2cncn2C)c2ccc(cc2C1)C#N