Reaction Details
TargetThymidine phosphorylase
LigandBDBM20079
Substrate/Competitorn/a
Meas. Tech.ChEMBL_302455 (CHEMBL827151)
Ki 20±n/a nM
Citation Reigan, PEdwards, PNGbaj, ACole, CBarry, STPage, KMAshton, SELuke, RWDouglas, KTStratford, IJJaffar, MBryce, RAFreeman, S Aminoimidazolylmethyluracil analogues as potent inhibitors of thymidine phosphorylase and their bioreductive nitroimidazolyl prodrugs. J Med Chem48:392-402 (2005) 
 
Thymidine phosphorylase
Name:Thymidine phosphorylase
Type:Enzyme
Mol. Mass.:49948.87
Organism:Homo sapiens (Human)
Description:The recombinant human thymidine phosphorylase (V79TP) was expressed in V79 Chinese hamster cells (Sigma, T-9319).
Residue:482
BDBM20079
NameBDBM20079
Synonyms:5-chloro-6-[(2-iminopyrrolidin-1-yl)methyl]-1,2,3,4-tetrahydropyrimidine-2,4-dione CHEMBL65375 TPI | Tipiracil
TypeSmall organic molecule
Emp. Form.C9H11ClN4O2
Mol. Mass.242.662
SMILESClc1c(CN2CCCC2=N)[nH]c(=O)[nH]c1=O