Reaction Details
TargetReverse transcriptase/RNaseH
LigandBDBM50164640
Substrate/Competitorn/a
Meas. Tech.ChEMBL_302539 (CHEMBL875215)
Ki 94±n/a nM
Citation Boyle, NARajwanshi, VKPrhavc, MWang, GFagan, PChen, FEwing, GJBrooks, JLHurd, TLeeds, JMBruice, TWCook, PD Synthesis of 2',3'-dideoxynucleoside 5'-alpha-P-borano-beta,gamma-(difluoromethylene)triphosphates and their inhibition of HIV-1 reverse transcriptase. J Med Chem48:2695-700 (2005) 
 
Reverse transcriptase/RNaseH
Name:Reverse transcriptase/RNaseH
Type:PROTEIN
Mol. Mass.:65229.15
Organism:Human immunodeficiency virus 1
Description:ChEMBL_1473730
Residue:566
BDBM50164640
NameBDBM50164640
Synonyms:CHEMBL190609 | [[[[3-azido-5-(5-methyl-2,4-dioxo-1H-pyrimidin-1-yl)-tetrahydrofuran-2-yl]methoxy-boranyl-phosphoryl]oxy-hydroxy-phosphoryl]-difluoro-methyl]phosphonic acid
TypeSmall organic molecule
Emp. Form.C11H15BF2N5O11P3
Mol. Mass.534.995
SMILES[BH3-]P(=O)(OCC1OC(CC1N=[N+]=[N-])n1cc(C)c(=O)[nH]c1=O)OP([O-])(=O)C(F)(F)P([O-])([O-])=O