Reaction Details
TargetReverse transcriptase/RNaseH
LigandBDBM50164648
Substrate/Competitorn/a
Meas. Tech.ChEMBL_302539 (CHEMBL875215)
Ki 61±n/a nM
Citation Boyle, NARajwanshi, VKPrhavc, MWang, GFagan, PChen, FEwing, GJBrooks, JLHurd, TLeeds, JMBruice, TWCook, PD Synthesis of 2',3'-dideoxynucleoside 5'-alpha-P-borano-beta,gamma-(difluoromethylene)triphosphates and their inhibition of HIV-1 reverse transcriptase. J Med Chem48:2695-700 (2005) 
 
Reverse transcriptase/RNaseH
Name:Reverse transcriptase/RNaseH
Type:PROTEIN
Mol. Mass.:65229.15
Organism:Human immunodeficiency virus 1
Description:ChEMBL_1473730
Residue:566
BDBM50164648
NameBDBM50164648
Synonyms:2'-deoxythymidine triphosphate CHEMBL363559 dThd5'PPP pppdT thymidine 5'-triphosphate
TypeSmall organic molecule
Emp. Form.C10H17N2O14P3
Mol. Mass.482.1683
SMILESCc1cn([C@H]2C[C@H](O)[C@@H](COP(O)(=O)OP(O)(=O)OP(O)(O)=O)O2)c(=O)[nH]c1=O