Reaction Details
TargetReverse transcriptase/RNaseH
LigandBDBM50145605
Substrate/Competitorn/a
Meas. Tech.ChEMBL_302539 (CHEMBL875215)
Ki 51±n/a nM
Citation Boyle, NARajwanshi, VKPrhavc, MWang, GFagan, PChen, FEwing, GJBrooks, JLHurd, TLeeds, JMBruice, TWCook, PD Synthesis of 2',3'-dideoxynucleoside 5'-alpha-P-borano-beta,gamma-(difluoromethylene)triphosphates and their inhibition of HIV-1 reverse transcriptase. J Med Chem48:2695-700 (2005) 
 
Reverse transcriptase/RNaseH
Name:Reverse transcriptase/RNaseH
Type:PROTEIN
Mol. Mass.:65229.15
Organism:Human immunodeficiency virus 1
Description:ChEMBL_1473730
Residue:566
BDBM50145605
NameBDBM50145605
Synonyms:4-amino-1-[(2R,5S)-5-(hydroxymethyl)tetrahydrofuran-2-yl]pyrimidin-2(1H)-one DDC Dideoxycytidine | ZALCITABINE
TypeSmall organic molecule
Emp. Form.C9H13N3O3
Mol. Mass.211.2178
SMILESNc1ccn([C@H]2CC[C@@H](CO)O2)c(=O)n1