Reaction Details
TargetReverse transcriptase/RNaseH
LigandBDBM50164654
Substrate/Competitorn/a
Meas. Tech.ChEMBL_302539 (CHEMBL875215)
Ki 37±n/a nM
Citation Boyle, NARajwanshi, VKPrhavc, MWang, GFagan, PChen, FEwing, GJBrooks, JLHurd, TLeeds, JMBruice, TWCook, PD Synthesis of 2',3'-dideoxynucleoside 5'-alpha-P-borano-beta,gamma-(difluoromethylene)triphosphates and their inhibition of HIV-1 reverse transcriptase. J Med Chem48:2695-700 (2005) 
 
Reverse transcriptase/RNaseH
Name:Reverse transcriptase/RNaseH
Type:PROTEIN
Mol. Mass.:65229.15
Organism:Human immunodeficiency virus 1
Description:ChEMBL_1473730
Residue:566
BDBM50164654
NameBDBM50164654
Synonyms:CHEMBL370031 | [[[4-(2-amino-6-oxo-3,9-dihydropurin-9-yl)-1-cyclopent-2-enyl]methoxy-hydroxy-phosphoryl]oxy-hydroxy-phosphoryl]oxyphosphonic acid
TypeSmall organic molecule
Emp. Form.C11H16N5O11P3
Mol. Mass.487.1929
SMILESNc1nc2n(cnc2c(=O)[nH]1)[C@@H]1CC(COP(O)(=O)OP(O)(=O)OP(O)(O)=O)C=C1