Reaction Details
TargetCannabinoid receptor 1
LigandBDBM50172553
Substrate/Competitorn/a
Meas. Tech.ChEMBL_320853 (CHEMBL884778)
Ki 0.75±n/a nM
Citation Deng, HGifford, ANZvonok, AMCui, GLi, XFan, PDeschamps, JRFlippen-Anderson, JLGatley, SJMakriyannis, A Potent cannabinergic indole analogues as radioiodinatable brain imaging agents for the CB1 cannabinoid receptor. J Med Chem48:6386-92 (2005) 
 
Cannabinoid receptor 1
Name:Cannabinoid receptor 1
Type:G Protein-Coupled Receptor (GPCR)
Mol. Mass.:52856.55
Organism:Rattus norvegicus (rat)
Description:P20272
Residue:473
BDBM50172553
NameBDBM50172553
Synonyms:CHEMBL68641 | [1-(1-Methyl-piperidin-2-ylmethyl)-1H-indol-3-yl]-naphthalen-1-yl-methanone
TypeSmall organic molecule
Emp. Form.C26H26N2O
Mol. Mass.382.4974
SMILESCN1CCCCC1Cn1cc(C(=O)c2cccc3ccccc23)c2ccccc12