Reaction Details
TargetCannabinoid receptor 1
LigandBDBM50174546
Substrate/Competitorn/a
Meas. Tech.ChEMBL_320853 (CHEMBL884778)
Ki 1800±n/a nM
Citation Deng, HGifford, ANZvonok, AMCui, GLi, XFan, PDeschamps, JRFlippen-Anderson, JLGatley, SJMakriyannis, A Potent cannabinergic indole analogues as radioiodinatable brain imaging agents for the CB1 cannabinoid receptor. J Med Chem48:6386-92 (2005) 
 
Cannabinoid receptor 1
Name:Cannabinoid receptor 1
Type:G Protein-Coupled Receptor (GPCR)
Mol. Mass.:52856.55
Organism:Rattus norvegicus (rat)
Description:P20272
Residue:473
BDBM50174546
NameBDBM50174546
Synonyms:(4-Iodo-phenyl)-[2-methyl-1-(1-methyl-piperidin-2-ylmethyl)-1H-indol-3-yl]-methanone | CHEMBL196592
TypeSmall organic molecule
Emp. Form.C23H25IN2O
Mol. Mass.472.3619
SMILESCN1CCCCC1Cn1c(C)c(C(=O)c2ccc(I)cc2)c2ccccc12