Reaction Details
TargetType-1 angiotensin II receptor B
LigandBDBM50175585
Substrate/Competitorn/a
Meas. Tech.ChEMBL_321028 (CHEMBL883660)
pH7.4±n/a
Ki>10000±n/a nM
Commentsextracted
Citation Georgsson, JSköld, CPlouffe, BLindeberg, GBotros, MLarhed, MNyberg, FGallo-Payet, NGogoll, AKarlén, AHallberg, A Angiotensin II pseudopeptides containing 1,3,5-trisubstituted benzene scaffolds with high AT2 receptor affinity. J Med Chem48:6620-31 (2005) 
 
Type-1 angiotensin II receptor B
Name:Type-1 angiotensin II receptor B
Type:Enzyme Catalytic Domain
Mol. Mass.:40929.44
Organism:RAT
Description:Angiotensin II AT1B 0 RAT::P29089
Residue:359
BDBM50175585
NameBDBM50175585
Synonyms:(S)-3-Amino-N-{(S)-1-[3-[(S)-2-[2-((S)-(S)-1-carboxy-2-phenyl-ethylcarbamoyl)-pyrrolidin-1-yl]-1-(3H-imidazol-4-ylmethyl)-2-oxo-ethylcarbamoyl]-5-(4-hydroxy-benzyl)-benzylcarbamoyl]-4-guanidino-butyl}-succinamic acid | CHEMBL196316
TypeSmall organic molecule
Emp. Form.C45H55N11O10
Mol. Mass.909.9859
SMILESN[C@@H](CC(O)=O)C(=O)N[C@@H](CCCNC(N)=N)C(=O)NCc1cc(Cc2ccc(O)cc2)cc(c1)C(=O)N[C@@H](Cc1cnc[nH]1)C(=O)N1CCC[C@H]1C(=O)N[C@@H](Cc1ccccc1)C(O)=O