Reaction Details
TargetType-1 angiotensin II receptor B
LigandBDBM50370686
Substrate/Competitorn/a
Meas. Tech.ChEMBL_321028 (CHEMBL883660)
pH7.4±n/a
Ki>10000±n/a nM
Commentsextracted
Citation Georgsson, JSköld, CPlouffe, BLindeberg, GBotros, MLarhed, MNyberg, FGallo-Payet, NGogoll, AKarlén, AHallberg, A Angiotensin II pseudopeptides containing 1,3,5-trisubstituted benzene scaffolds with high AT2 receptor affinity. J Med Chem48:6620-31 (2005) 
 
Type-1 angiotensin II receptor B
Name:Type-1 angiotensin II receptor B
Type:Enzyme Catalytic Domain
Mol. Mass.:40929.44
Organism:RAT
Description:Angiotensin II AT1B 0 RAT::P29089
Residue:359
BDBM50370686
NameBDBM50370686
Synonyms:CHEMBL1791350
TypeSmall organic molecule
Emp. Form.C46H68N12O11
Mol. Mass.965.1059
SMILESCC[C@@H](C)[C@H](NC(=O)[C@H](N)NC(=O)[C@@H](NC(=O)[C@H](CCCN=C(N)N)NC(=O)[C@@H](N)CC(O)=O)C(C)C)C(=O)N[C@@H](Cc1ccccc1)C(=O)N1CCC[C@H]1C(=O)N[C@@H](Cc1ccccc1)C(O)=O