Reaction Details
TargetcAMP-specific 3',5'-cyclic phosphodiesterase 4C
LigandBDBM50174023
Substrate/Competitorn/a
Meas. Tech.ChEMBL_326771 (CHEMBL860121)
IC50 5.7±n/a nM
Citation Macdonald, DMastracchio, APerrier, HDubé, DGallant, MLacombe, PDeschênes, DRoy, BScheigetz, JBateman, KLi, CTrimble, LADay, SChauret, NNicoll-Griffith, DASilva, JMHuang, ZLaliberté, FLiu, SEthier, DPon, DMuise, EBoulet, LChan, CCStyhler, ACharleson, SMancini, JMasson, PClaveau, DNicholson, DTurner, MYoung, RNGirard, Y Discovery of a substituted 8-arylquinoline series of PDE4 inhibitors: structure-activity relationship, optimization, and identification of a highly potent, well tolerated, PDE4 inhibitor. Bioorg Med Chem Lett15:5241-6 (2005) 
 
cAMP-specific 3',5'-cyclic phosphodiesterase 4C
Name:cAMP-specific 3',5'-cyclic phosphodiesterase 4C
Type:Enzyme Catalytic Domain
Mol. Mass.:79875.54
Organism:Homo sapiens (Human)
Description:Q08493
Residue:712
BDBM50174023
NameBDBM50174023
Synonyms:(E)-6-isopropyl-8-(3-(2-(3-methyl-1,2,4-oxadiazol-5-yl)-2-(pyridin-2-yl)vinyl)phenyl)quinoline | CHEMBL197494
TypeSmall organic molecule
Emp. Form.C28H24N4O
Mol. Mass.432.5164
SMILESCC(C)c1cc(-c2cccc(\C=C(\c3nc(C)no3)c3ccccn3)c2)c2ncccc2c1