Reaction Details
TargetcAMP-specific 3',5'-cyclic phosphodiesterase 4D
LigandBDBM50174016
Substrate/Competitorn/a
Meas. Tech.ChEMBL_326772 (CHEMBL860122)
IC50 2±n/a nM
Citation Macdonald, DMastracchio, APerrier, HDubé, DGallant, MLacombe, PDeschênes, DRoy, BScheigetz, JBateman, KLi, CTrimble, LADay, SChauret, NNicoll-Griffith, DASilva, JMHuang, ZLaliberté, FLiu, SEthier, DPon, DMuise, EBoulet, LChan, CCStyhler, ACharleson, SMancini, JMasson, PClaveau, DNicholson, DTurner, MYoung, RNGirard, Y Discovery of a substituted 8-arylquinoline series of PDE4 inhibitors: structure-activity relationship, optimization, and identification of a highly potent, well tolerated, PDE4 inhibitor. Bioorg Med Chem Lett15:5241-6 (2005) 
 
cAMP-specific 3',5'-cyclic phosphodiesterase 4D
Name:cAMP-specific 3',5'-cyclic phosphodiesterase 4D
Type:Protein
Mol. Mass.:91092.69
Organism:Homo sapiens (Human)
Description:Q08499
Residue:809
BDBM50174016
NameBDBM50174016
Synonyms:CHEMBL370220 | N-(3-(6-(pyridin-4-ylmethyl)quinolin-8-yl)phenyl)benzenesulfonamide
TypeSmall organic molecule
Emp. Form.C27H21N3O2S
Mol. Mass.451.54
SMILESO=S(=O)(Nc1cccc(c1)-c1cc(Cc2ccncc2)cc2cccnc12)c1ccccc1