Reaction Details
TargetcAMP-specific 3',5'-cyclic phosphodiesterase 4B
LigandBDBM50174014
Substrate/Competitorn/a
Meas. Tech.ChEMBL_326770 (CHEMBL860120)
IC50 1.8±n/a nM
Citation Macdonald, DMastracchio, APerrier, HDubé, DGallant, MLacombe, PDeschênes, DRoy, BScheigetz, JBateman, KLi, CTrimble, LADay, SChauret, NNicoll-Griffith, DASilva, JMHuang, ZLaliberté, FLiu, SEthier, DPon, DMuise, EBoulet, LChan, CCStyhler, ACharleson, SMancini, JMasson, PClaveau, DNicholson, DTurner, MYoung, RNGirard, Y Discovery of a substituted 8-arylquinoline series of PDE4 inhibitors: structure-activity relationship, optimization, and identification of a highly potent, well tolerated, PDE4 inhibitor. Bioorg Med Chem Lett15:5241-6 (2005) 
 
cAMP-specific 3',5'-cyclic phosphodiesterase 4B
Name:cAMP-specific 3',5'-cyclic phosphodiesterase 4B
Type:Protein
Mol. Mass.:83318.87
Organism:Homo sapiens (Human)
Description:Q07343
Residue:736
BDBM50174014
NameBDBM50174014
Synonyms:4-(3-(6-isopropylquinolin-8-yl)phenyl)-2-methyl-3-(pyridin-4-yl)butan-2-ol | CHEMBL198564
TypeSmall organic molecule
Emp. Form.C28H30N2O
Mol. Mass.410.5506
SMILESCC(C)c1cc(-c2cccc(CC(c3ccncc3)C(C)(C)O)c2)c2ncccc2c1