Reaction Details
TargetcAMP-specific 3',5'-cyclic phosphodiesterase 4A
LigandBDBM50174027
Substrate/Competitorn/a
Meas. Tech.ChEMBL_326769 (CHEMBL860119)
IC50 1.7±n/a nM
Citation Macdonald, DMastracchio, APerrier, HDubé, DGallant, MLacombe, PDeschênes, DRoy, BScheigetz, JBateman, KLi, CTrimble, LADay, SChauret, NNicoll-Griffith, DASilva, JMHuang, ZLaliberté, FLiu, SEthier, DPon, DMuise, EBoulet, LChan, CCStyhler, ACharleson, SMancini, JMasson, PClaveau, DNicholson, DTurner, MYoung, RNGirard, Y Discovery of a substituted 8-arylquinoline series of PDE4 inhibitors: structure-activity relationship, optimization, and identification of a highly potent, well tolerated, PDE4 inhibitor. Bioorg Med Chem Lett15:5241-6 (2005) 
 
cAMP-specific 3',5'-cyclic phosphodiesterase 4A
Name:cAMP-specific 3',5'-cyclic phosphodiesterase 4A
Type:Enzyme
Mol. Mass.:98113.27
Organism:Homo sapiens (Human)
Description:P27815
Residue:886
BDBM50174027
NameBDBM50174027
Synonyms:2-(2-(2-(3-(6-(1-(methylsulfonyl)ethyl)quinolin-8-yl)phenyl)-1-(4-(methylsulfonyl)phenyl)vinyl)thiazol-5-yl)propan-2-ol | CHEMBL198722
TypeSmall organic molecule
Emp. Form.C33H32N2O5S3
Mol. Mass.632.813
SMILESCC(c1cc(-c2cccc(\C=C(\c3ncc(s3)C(C)(C)O)c3ccc(cc3)S(C)(=O)=O)c2)c2ncccc2c1)S(C)(=O)=O